BDBM50439239 CHEMBL2418994
SMILES NC(CCCCB(O)O)(C1CCN(Cc2ccccc2)CC1)C(O)=O
InChI Key InChIKey=BAKHNESOOOCXTE-UHFFFAOYSA-N
Data  2 IC50
  Tab Delimited (TSV)   2D SDfile   Computed 3D by Vconf -m prep SDfile
Find this compound or compounds like it in BindingDB:
Activity Spreadsheet -- Enzyme Inhibition Constant Data from BindingDB
Found 1 hit for monomerid = 50439239
TargetArginase-2, mitochondrial(Homo sapiens (Human))
Institutes For Pharmaceutical Discovery
Curated by ChEMBL
LigandPNGBDBM50439239(CHEMBL2418994)
Affinity DataIC50:  230nM. Assay description: Inhibition of human arginase-2 assessed as L-arginine conversion to L-ornithine measured as urea level after 1 hr by colorimetric assay
In DepthDetails ArticlePubMed